BDBM50081984 7-Methyl-4-piperazin-1-yl-pyrrolo[1,2-a]quinoxaline::CHEMBL136979
SMILES Cc1ccc2c(c1)nc(N1CCNCC1)c1cccn21
InChI Key InChIKey=LCFCSDODEGYYOR-UHFFFAOYSA-N
Data  1 IC50
  Tab Delimited (TSV)   2D SDfile   Computed 3D by Vconf -m prep SDfile
Find this compound or compounds like it in BindingDB:
Activity Spreadsheet -- Enzyme Inhibition Constant Data from BindingDB
Found 1 hit for monomerid = 50081984
Target5-hydroxytryptamine receptor 3A/3B(Rattus norvegicus)
Universita' Degli Studi Di Salerno
Curated by ChEMBL
LigandPNGBDBM50081984(7-Methyl-4-piperazin-1-yl-pyrrolo[1,2-a]quinoxalin...)
Affinity DataIC50:  16.4nM. Assay description: Binding affinity against 5-hydroxytryptamine 3 (5-HT3) receptor from rat cortical homogenate using [3H]-zacopride as radioligand
In DepthDetails ArticlePubMed